This file contains any messages produced by compilers while
running configure, to aid debugging if configure makes a mistake.

It was created by configure, which was
generated by GNU Autoconf 2.69.  Invocation command line was

  $ /home/tcwg-build/workspace/tcwg_gnu_6/abe/snapshots/gcc.git~master/configure SHELL=/bin/bash --with-mpc=/home/tcwg-build/workspace/tcwg_gnu_6/abe/builds/destdir/aarch64-unknown-linux-gnu --with-mpfr=/home/tcwg-build/workspace/tcwg_gnu_6/abe/builds/destdir/aarch64-unknown-linux-gnu --with-gmp=/home/tcwg-build/workspace/tcwg_gnu_6/abe/builds/destdir/aarch64-unknown-linux-gnu --with-gnu-as --with-gnu-ld --disable-libmudflap --enable-lto --enable-shared --without-included-gettext --enable-nls --with-system-zlib --disable-sjlj-exceptions --enable-gnu-unique-object --enable-linker-build-id --disable-libstdcxx-pch --enable-c99 --enable-clocale=gnu --enable-libstdcxx-debug --enable-long-long --with-cloog=no --with-ppl=no --with-isl=no --disable-multilib --enable-fix-cortex-a53-835769 --enable-fix-cortex-a53-843419 --with-arch=armv8-a --enable-threads=posix --enable-multiarch --enable-libstdcxx-time=yes --enable-gnu-indirect-function --enable-checking=yes --disable-bootstrap --enable-languages=default --prefix=/home/tcwg-build/workspace/tcwg_gnu_6/abe/builds/destdir/aarch64-unknown-linux-gnu

## --------- ##
## Platform. ##
## --------- ##

hostname = 41cf44d68fc0
uname -m = aarch64
uname -r = 6.17.0-1017-aws
uname -s = Linux
uname -v = #17~24.04.1-Ubuntu SMP Tue May 26 21:09:53 UTC 2026

/usr/bin/uname -p = aarch64
/bin/uname -X     = unknown

/bin/arch              = aarch64
/usr/bin/arch -k       = unknown
/usr/convex/getsysinfo = unknown
/usr/bin/hostinfo      = unknown
/bin/machine           = unknown
/usr/bin/oslevel       = unknown
/bin/universe          = unknown

PATH: /home/tcwg-build/workspace/tcwg_gnu_6/abe/builds/hosttools/aarch64-unknown-linux-gnu/bin
PATH: /home/tcwg-build/workspace/tcwg_gnu_6/abe/bin
PATH: /usr/local/sbin
PATH: /usr/local/bin
PATH: /usr/sbin
PATH: /usr/bin
PATH: /sbin
PATH: /bin
PATH: /usr/games
PATH: /usr/local/games
PATH: /snap/bin


## ----------- ##
## Core tests. ##
## ----------- ##

configure:2471: checking build system type
configure:2485: result: aarch64-unknown-linux-gnu
configure:2532: checking host system type
configure:2545: result: aarch64-unknown-linux-gnu
configure:2565: checking target system type
configure:2578: result: aarch64-unknown-linux-gnu
configure:2631: checking for a BSD-compatible install
configure:2699: result: /usr/bin/install -c
configure:2710: checking whether ln works
configure:2732: result: yes
configure:2736: checking whether ln -s works
configure:2740: result: yes
configure:2747: checking for a sed that does not truncate output
configure:2811: result: /usr/bin/sed
configure:2820: checking for gawk
configure:2836: found /usr/bin/gawk
configure:2847: result: gawk
configure:3400: checking for libatomic support
configure:3410: result: yes
configure:3419: checking for libitm support
configure:3429: result: yes
configure:3438: checking for libsanitizer support
configure:3448: result: yes
configure:3457: checking for libvtv support
configure:3467: result: yes
configure:3615: checking for libphobos support
configure:3625: result: yes
configure:3635: checking for libgcobol support
configure:3645: result: yes
configure:4418: checking for gcc
configure:4434: found /home/tcwg-build/workspace/tcwg_gnu_6/abe/bin/gcc
configure:4445: result: gcc
configure:4674: checking for C compiler version
configure:4683: gcc --version >&5
gcc (Ubuntu 13.3.0-6ubuntu2~24.04.1) 13.3.0
Copyright (C) 2023 Free Software Foundation, Inc.
This is free software; see the source for copying conditions.  There is NO
warranty; not even for MERCHANTABILITY or FITNESS FOR A PARTICULAR PURPOSE.

configure:4694: $? = 0
configure:4683: gcc -v >&5
Using built-in specs.
COLLECT_GCC=/usr/bin/gcc
COLLECT_LTO_WRAPPER=/usr/libexec/gcc/aarch64-linux-gnu/13/lto-wrapper
OFFLOAD_TARGET_NAMES=nvptx-none
OFFLOAD_TARGET_DEFAULT=1
Target: aarch64-linux-gnu
Configured with: ../src/configure -v --with-pkgversion='Ubuntu 13.3.0-6ubuntu2~24.04.1' --with-bugurl=file:///usr/share/doc/gcc-13/README.Bugs --enable-languages=c,ada,c++,go,d,fortran,objc,obj-c++,m2 --prefix=/usr --with-gcc-major-version-only --program-suffix=-13 --program-prefix=aarch64-linux-gnu- --enable-shared --enable-linker-build-id --libexecdir=/usr/libexec --without-included-gettext --enable-threads=posix --libdir=/usr/lib --enable-nls --enable-bootstrap --enable-clocale=gnu --enable-libstdcxx-debug --enable-libstdcxx-time=yes --with-default-libstdcxx-abi=new --enable-libstdcxx-backtrace --enable-gnu-unique-object --disable-libquadmath --disable-libquadmath-support --enable-plugin --enable-default-pie --with-system-zlib --enable-libphobos-checking=release --with-target-system-zlib=auto --enable-objc-gc=auto --enable-multiarch --enable-fix-cortex-a53-843419 --disable-werror --enable-offload-targets=nvptx-none=/build/gcc-13-f9pAEi/gcc-13-13.3.0/debian/tmp-nvptx/usr --enable-offload-defaulted --without-cuda-driver --enable-checking=release --build=aarch64-linux-gnu --host=aarch64-linux-gnu --target=aarch64-linux-gnu --with-build-config=bootstrap-lto-lean --enable-link-serialization=4
Thread model: posix
Supported LTO compression algorithms: zlib zstd
gcc version 13.3.0 (Ubuntu 13.3.0-6ubuntu2~24.04.1) 
... rest of stderr output deleted ...
configure:4694: $? = 0
configure:4683: gcc -V >&5
gcc: error: unrecognized command-line option '-V'
gcc: fatal error: no input files
compilation terminated.
configure:4694: $? = 1
configure:4683: gcc -qversion >&5
gcc: error: unrecognized command-line option '-qversion'; did you mean '--version'?
gcc: fatal error: no input files
compilation terminated.
configure:4694: $? = 1
configure:4714: checking whether the C compiler works
configure:4736: gcc    conftest.c  >&5
configure:4740: $? = 0
configure:4788: result: yes
configure:4791: checking for C compiler default output file name
configure:4793: result: a.out
configure:4799: checking for suffix of executables
configure:4806: gcc -o conftest    conftest.c  >&5
configure:4810: $? = 0
configure:4832: result: 
configure:4854: checking whether we are cross compiling
configure:4862: gcc -o conftest    conftest.c  >&5
configure:4866: $? = 0
configure:4873: ./conftest
configure:4877: $? = 0
configure:4892: result: no
configure:4897: checking for suffix of object files
configure:4919: gcc -c   conftest.c >&5
configure:4923: $? = 0
configure:4944: result: o
configure:4948: checking whether we are using the GNU C compiler
configure:4967: gcc -c   conftest.c >&5
configure:4967: $? = 0
configure:4976: result: yes
configure:4985: checking whether gcc accepts -g
configure:5005: gcc -c -g  conftest.c >&5
configure:5005: $? = 0
configure:5046: result: yes
configure:5063: checking for gcc option to accept ISO C89
configure:5126: gcc  -c -g -O2  conftest.c >&5
configure:5126: $? = 0
configure:5139: result: none needed
configure:5159: checking for gcc option to accept ISO C99
configure:5308: gcc  -c -g -O2  conftest.c >&5
configure:5308: $? = 0
configure:5321: result: none needed
configure:5394: checking for g++
configure:5410: found /home/tcwg-build/workspace/tcwg_gnu_6/abe/bin/g++
configure:5421: result: g++
configure:5448: checking for C++ compiler version
configure:5457: g++ --version >&5
g++ (Ubuntu 13.3.0-6ubuntu2~24.04.1) 13.3.0
Copyright (C) 2023 Free Software Foundation, Inc.
This is free software; see the source for copying conditions.  There is NO
warranty; not even for MERCHANTABILITY or FITNESS FOR A PARTICULAR PURPOSE.

configure:5468: $? = 0
configure:5457: g++ -v >&5
Using built-in specs.
COLLECT_GCC=/usr/bin/g++
COLLECT_LTO_WRAPPER=/usr/libexec/gcc/aarch64-linux-gnu/13/lto-wrapper
OFFLOAD_TARGET_NAMES=nvptx-none
OFFLOAD_TARGET_DEFAULT=1
Target: aarch64-linux-gnu
Configured with: ../src/configure -v --with-pkgversion='Ubuntu 13.3.0-6ubuntu2~24.04.1' --with-bugurl=file:///usr/share/doc/gcc-13/README.Bugs --enable-languages=c,ada,c++,go,d,fortran,objc,obj-c++,m2 --prefix=/usr --with-gcc-major-version-only --program-suffix=-13 --program-prefix=aarch64-linux-gnu- --enable-shared --enable-linker-build-id --libexecdir=/usr/libexec --without-included-gettext --enable-threads=posix --libdir=/usr/lib --enable-nls --enable-bootstrap --enable-clocale=gnu --enable-libstdcxx-debug --enable-libstdcxx-time=yes --with-default-libstdcxx-abi=new --enable-libstdcxx-backtrace --enable-gnu-unique-object --disable-libquadmath --disable-libquadmath-support --enable-plugin --enable-default-pie --with-system-zlib --enable-libphobos-checking=release --with-target-system-zlib=auto --enable-objc-gc=auto --enable-multiarch --enable-fix-cortex-a53-843419 --disable-werror --enable-offload-targets=nvptx-none=/build/gcc-13-f9pAEi/gcc-13-13.3.0/debian/tmp-nvptx/usr --enable-offload-defaulted --without-cuda-driver --enable-checking=release --build=aarch64-linux-gnu --host=aarch64-linux-gnu --target=aarch64-linux-gnu --with-build-config=bootstrap-lto-lean --enable-link-serialization=4
Thread model: posix
Supported LTO compression algorithms: zlib zstd
gcc version 13.3.0 (Ubuntu 13.3.0-6ubuntu2~24.04.1) 
... rest of stderr output deleted ...
configure:5468: $? = 0
configure:5457: g++ -V >&5
g++: error: unrecognized command-line option '-V'
g++: fatal error: no input files
compilation terminated.
configure:5468: $? = 1
configure:5457: g++ -qversion >&5
g++: error: unrecognized command-line option '-qversion'; did you mean '--version'?
g++: fatal error: no input files
compilation terminated.
configure:5468: $? = 1
configure:5472: checking whether we are using the GNU C++ compiler
configure:5491: g++ -c   conftest.cpp >&5
configure:5491: $? = 0
configure:5500: result: yes
configure:5509: checking whether g++ accepts -g
configure:5529: g++ -c -g  conftest.cpp >&5
configure:5529: $? = 0
configure:5570: result: yes
configure:5619: checking whether g++ accepts -static-libstdc++ -static-libgcc
configure:5636: g++ -o conftest -g -O2   -static-libstdc++ -static-libgcc conftest.cpp  >&5
configure:5636: $? = 0
configure:5637: result: yes
configure:5699: checking for gnatbind
configure:5715: found /usr/bin/gnatbind
configure:5726: result: gnatbind
configure:5791: checking for gnatmake
configure:5807: found /usr/bin/gnatmake
configure:5818: result: gnatmake
configure:5840: checking whether compiler driver understands Ada and is recent enough
configure:5867: result: yes
configure:5920: checking for ga68
configure:5950: result: no
configure:6013: checking for gdc
configure:6029: found /usr/bin/gdc
configure:6040: result: gdc
configure:6062: checking whether the D compiler works
configure:6079: result: yes
configure:6091: checking for cargo
configure:6121: result: no
configure:6135: checking how to compare bootstrapped objects
configure:6168: result: cmp --ignore-initial=16 $$f1 $$f2
configure:6235: checking whether g++ supports C++14 features by default
configure:6651: g++ -c -g -O2  conftest.cpp >&5
configure:6651: $? = 0
configure:6658: result: yes
configure:9032: checking for objdir
configure:9047: result: .libs
configure:9217: checking for the correct version of gmp.h
configure:9236: gcc -c -g -O2 -I/home/tcwg-build/workspace/tcwg_gnu_6/abe/builds/destdir/aarch64-unknown-linux-gnu/include -I/home/tcwg-build/workspace/tcwg_gnu_6/abe/builds/destdir/aarch64-unknown-linux-gnu/include -I/home/tcwg-build/workspace/tcwg_gnu_6/abe/builds/destdir/aarch64-unknown-linux-gnu/include   conftest.c >&5
configure:9236: $? = 0
configure:9254: gcc -c -g -O2 -I/home/tcwg-build/workspace/tcwg_gnu_6/abe/builds/destdir/aarch64-unknown-linux-gnu/include -I/home/tcwg-build/workspace/tcwg_gnu_6/abe/builds/destdir/aarch64-unknown-linux-gnu/include -I/home/tcwg-build/workspace/tcwg_gnu_6/abe/builds/destdir/aarch64-unknown-linux-gnu/include   conftest.c >&5
configure:9254: $? = 0
configure:9255: result: yes
configure:9271: checking for the correct version of mpfr.h
configure:9289: gcc -c -g -O2 -I/home/tcwg-build/workspace/tcwg_gnu_6/abe/builds/destdir/aarch64-unknown-linux-gnu/include -I/home/tcwg-build/workspace/tcwg_gnu_6/abe/builds/destdir/aarch64-unknown-linux-gnu/include -I/home/tcwg-build/workspace/tcwg_gnu_6/abe/builds/destdir/aarch64-unknown-linux-gnu/include   conftest.c >&5
configure:9289: $? = 0
configure:9306: gcc -c -g -O2 -I/home/tcwg-build/workspace/tcwg_gnu_6/abe/builds/destdir/aarch64-unknown-linux-gnu/include -I/home/tcwg-build/workspace/tcwg_gnu_6/abe/builds/destdir/aarch64-unknown-linux-gnu/include -I/home/tcwg-build/workspace/tcwg_gnu_6/abe/builds/destdir/aarch64-unknown-linux-gnu/include   conftest.c >&5
configure:9306: $? = 0
configure:9307: result: yes
configure:9324: checking for the correct version of mpc.h
configure:9341: gcc -c -g -O2 -I/home/tcwg-build/workspace/tcwg_gnu_6/abe/builds/destdir/aarch64-unknown-linux-gnu/include -I/home/tcwg-build/workspace/tcwg_gnu_6/abe/builds/destdir/aarch64-unknown-linux-gnu/include -I/home/tcwg-build/workspace/tcwg_gnu_6/abe/builds/destdir/aarch64-unknown-linux-gnu/include   conftest.c >&5
configure:9341: $? = 0
configure:9357: gcc -c -g -O2 -I/home/tcwg-build/workspace/tcwg_gnu_6/abe/builds/destdir/aarch64-unknown-linux-gnu/include -I/home/tcwg-build/workspace/tcwg_gnu_6/abe/builds/destdir/aarch64-unknown-linux-gnu/include -I/home/tcwg-build/workspace/tcwg_gnu_6/abe/builds/destdir/aarch64-unknown-linux-gnu/include   conftest.c >&5
configure:9357: $? = 0
configure:9358: result: yes
configure:9376: checking for the correct version of the gmp/mpfr libraries
configure:9400: gcc -o conftest -g -O2 -I/home/tcwg-build/workspace/tcwg_gnu_6/abe/builds/destdir/aarch64-unknown-linux-gnu/include -I/home/tcwg-build/workspace/tcwg_gnu_6/abe/builds/destdir/aarch64-unknown-linux-gnu/include -I/home/tcwg-build/workspace/tcwg_gnu_6/abe/builds/destdir/aarch64-unknown-linux-gnu/include    conftest.c  -L/home/tcwg-build/workspace/tcwg_gnu_6/abe/builds/destdir/aarch64-unknown-linux-gnu/lib -L/home/tcwg-build/workspace/tcwg_gnu_6/abe/builds/destdir/aarch64-unknown-linux-gnu/lib -L/home/tcwg-build/workspace/tcwg_gnu_6/abe/builds/destdir/aarch64-unknown-linux-gnu/lib -lmpc -lmpfr -lgmp >&5
configure:9400: $? = 0
configure:9401: result: yes
configure:9416: checking for the correct version of the mpc libraries
configure:9437: gcc -o conftest -g -O2 -I/home/tcwg-build/workspace/tcwg_gnu_6/abe/builds/destdir/aarch64-unknown-linux-gnu/include -I/home/tcwg-build/workspace/tcwg_gnu_6/abe/builds/destdir/aarch64-unknown-linux-gnu/include -I/home/tcwg-build/workspace/tcwg_gnu_6/abe/builds/destdir/aarch64-unknown-linux-gnu/include    conftest.c  -L/home/tcwg-build/workspace/tcwg_gnu_6/abe/builds/destdir/aarch64-unknown-linux-gnu/lib -L/home/tcwg-build/workspace/tcwg_gnu_6/abe/builds/destdir/aarch64-unknown-linux-gnu/lib -L/home/tcwg-build/workspace/tcwg_gnu_6/abe/builds/destdir/aarch64-unknown-linux-gnu/lib -lmpc -lmpfr -lgmp >&5
configure:9437: $? = 0
configure:9438: result: yes
configure:9905: checking whether to enable libgdiagnostics
configure:9937: result: no
configure:9950: checking for library containing dlopen
configure:9981: gcc -o conftest -g -O2   conftest.c  >&5
configure:9981: $? = 0
configure:9998: result: none required
configure:10006: checking for library containing pthread_create
configure:10037: gcc -o conftest -g -O2   conftest.c  >&5
configure:10037: $? = 0
configure:10054: result: none required
configure:11246: checking for default BUILD_CONFIG
configure:11278: result: 
configure:11283: checking for --enable-vtable-verify
configure:11296: result: no
configure:12007: checking for bison
configure:12023: found /usr/bin/bison
configure:12034: result: bison -y
configure:12054: checking for bison
configure:12070: found /usr/bin/bison
configure:12081: result: bison
configure:12101: checking for gm4
configure:12131: result: no
configure:12101: checking for gnum4
configure:12131: result: no
configure:12101: checking for m4
configure:12117: found /usr/bin/m4
configure:12128: result: m4
configure:12148: checking for flex
configure:12164: found /usr/bin/flex
configure:12175: result: flex
configure:12196: checking for flex
configure:12212: found /usr/bin/flex
configure:12223: result: flex
configure:12243: checking for makeinfo
configure:12259: found /home/tcwg-build/workspace/tcwg_gnu_6/abe/bin/makeinfo
configure:12270: result: makeinfo
configure:12304: checking for expect
configure:12320: found /usr/bin/expect
configure:12331: result: expect
configure:12353: checking for runtest
configure:12369: found /usr/bin/runtest
configure:12380: result: runtest
configure:12498: checking for ar
configure:12514: found /usr/bin/ar
configure:12525: result: ar
configure:12639: checking for as
configure:12655: found /usr/bin/as
configure:12666: result: as
configure:12780: checking for dlltool
configure:12810: result: no
configure:12921: checking for dsymutil
configure:12937: found /usr/bin/dsymutil
configure:12948: result: dsymutil
configure:13062: checking for ld
configure:13078: found /usr/bin/ld
configure:13089: result: ld
configure:13203: checking for lipo
configure:13233: result: no
configure:13344: checking for nm
configure:13360: found /usr/bin/nm
configure:13371: result: nm
configure:13485: checking for ranlib
configure:13501: found /usr/bin/ranlib
configure:13512: result: ranlib
configure:13621: checking for strip
configure:13637: found /usr/bin/strip
configure:13648: result: strip
configure:13757: checking for windres
configure:13787: result: no
configure:13898: checking for windmc
configure:13928: result: no
configure:14039: checking for objcopy
configure:14055: found /usr/bin/objcopy
configure:14066: result: objcopy
configure:14180: checking for objdump
configure:14196: found /usr/bin/objdump
configure:14207: result: objdump
configure:14321: checking for otool
configure:14351: result: no
configure:14462: checking for readelf
configure:14478: found /usr/bin/readelf
configure:14489: result: readelf
configure:14529: checking how to run the C preprocessor
configure:14560: gcc -E  conftest.c
configure:14560: $? = 0
configure:14574: gcc -E  conftest.c
conftest.c:11:10: fatal error: ac_nonexistent.h: No such file or directory
   11 | #include <ac_nonexistent.h>
      |          ^~~~~~~~~~~~~~~~~~
compilation terminated.
configure:14574: $? = 1
configure: failed program was:
| /* confdefs.h */
| #define PACKAGE_NAME ""
| #define PACKAGE_TARNAME ""
| #define PACKAGE_VERSION ""
| #define PACKAGE_STRING ""
| #define PACKAGE_BUGREPORT ""
| #define PACKAGE_URL ""
| #define HAVE_CXX14 1
| #define LT_OBJDIR ".libs/"
| /* end confdefs.h.  */
| #include <ac_nonexistent.h>
configure:14599: result: gcc -E
configure:14619: gcc -E  conftest.c
configure:14619: $? = 0
configure:14633: gcc -E  conftest.c
conftest.c:11:10: fatal error: ac_nonexistent.h: No such file or directory
   11 | #include <ac_nonexistent.h>
      |          ^~~~~~~~~~~~~~~~~~
compilation terminated.
configure:14633: $? = 1
configure: failed program was:
| /* confdefs.h */
| #define PACKAGE_NAME ""
| #define PACKAGE_TARNAME ""
| #define PACKAGE_VERSION ""
| #define PACKAGE_STRING ""
| #define PACKAGE_BUGREPORT ""
| #define PACKAGE_URL ""
| #define HAVE_CXX14 1
| #define LT_OBJDIR ".libs/"
| /* end confdefs.h.  */
| #include <ac_nonexistent.h>
configure:14662: checking for grep that handles long lines and -e
configure:14720: result: /usr/bin/grep
configure:14725: checking for egrep
configure:14787: result: /usr/bin/grep -E
configure:14792: checking for clang
configure:14815: result: no
configure:14860: checking for llvm-config
configure:14876: found /usr/bin/llvm-config
configure:14887: result: llvm-config
configure:15139: checking for -plugin option
configure:15157: result: --plugin /usr/libexec/gcc/aarch64-linux-gnu/13/liblto_plugin.so
configure:15316: checking for cc
configure:15332: found /home/tcwg-build/workspace/tcwg_gnu_6/abe/bin/cc
configure:15343: result: cc
configure:15477: checking for c++
configure:15493: found /home/tcwg-build/workspace/tcwg_gnu_6/abe/bin/c++
configure:15504: result: c++
configure:15638: checking for gcc
configure:15654: found /home/tcwg-build/workspace/tcwg_gnu_6/abe/bin/gcc
configure:15665: result: gcc
configure:15794: checking for gfortran
configure:15810: found /usr/bin/gfortran
configure:15821: result: gfortran
configure:15955: checking for ga68
configure:15985: result: no
configure:16116: checking for gccgo
configure:16146: result: no
configure:16277: checking for gdc
configure:16293: found /usr/bin/gdc
configure:16304: result: gdc
configure:16438: checking for gm2
configure:16454: found /usr/bin/gm2
configure:16465: result: gm2
configure:16534: checking for ar
configure:16567: result: no
configure:16684: checking for ar
configure:16700: found /usr/bin/ar
configure:16711: result: ar
configure:16769: checking for as
configure:16802: result: no
configure:16919: checking for as
configure:16935: found /usr/bin/as
configure:16946: result: as
configure:17004: checking for dlltool
configure:17037: result: no
configure:17154: checking for dlltool
configure:17184: result: no
configure:17239: checking for dsymutil
configure:17272: result: no
configure:17389: checking for dsymutil
configure:17405: found /usr/bin/dsymutil
configure:17416: result: dsymutil
configure:17474: checking for ld
configure:17507: result: no
configure:17624: checking for ld
configure:17640: found /usr/bin/ld
configure:17651: result: ld
configure:17709: checking for lipo
configure:17742: result: no
configure:17859: checking for lipo
configure:17889: result: no
configure:17944: checking for nm
configure:17977: result: no
configure:18094: checking for nm
configure:18110: found /usr/bin/nm
configure:18121: result: nm
configure:18179: checking for objcopy
configure:18212: result: no
configure:18329: checking for objcopy
configure:18345: found /usr/bin/objcopy
configure:18356: result: objcopy
configure:18414: checking for objdump
configure:18447: result: no
configure:18564: checking for objdump
configure:18580: found /usr/bin/objdump
configure:18591: result: objdump
configure:18649: checking for otool
configure:18682: result: no
configure:18799: checking for otool
configure:18829: result: no
configure:18884: checking for ranlib
configure:18917: result: no
configure:19034: checking for ranlib
configure:19050: found /usr/bin/ranlib
configure:19061: result: ranlib
configure:19119: checking for readelf
configure:19152: result: no
configure:19269: checking for readelf
configure:19285: found /usr/bin/readelf
configure:19296: result: readelf
configure:19354: checking for strip
configure:19387: result: no
configure:19504: checking for strip
configure:19520: found /usr/bin/strip
configure:19531: result: strip
configure:19589: checking for windres
configure:19622: result: no
configure:19739: checking for windres
configure:19769: result: no
configure:19824: checking for windmc
configure:19857: result: no
configure:19974: checking for windmc
configure:20004: result: no
configure:20032: checking where to find the target ar
configure:20065: result: host tool
configure:20074: checking where to find the target as
configure:20107: result: host tool
configure:20116: checking where to find the target cc
configure:20139: result: just compiled
configure:20252: checking where to find the target c++
configure:20278: result: just compiled
configure:20297: checking where to find the target c++ for libstdc++
configure:20323: result: just compiled
configure:20344: checking where to find the target dlltool
configure:20377: result: host tool
configure:20386: checking where to find the target dsymutil
configure:20408: result: host tool
configure:20417: checking where to find the target gcc
configure:20440: result: just compiled
configure:20459: checking where to find the target gfortran
configure:20485: result: just compiled
configure:20504: checking where to find the target gccgo
configure:20540: result: host tool
configure:20549: checking where to find the target ga68
configure:20585: result: host tool
configure:20594: checking where to find the target gdc
configure:20630: result: host tool
configure:20639: checking where to find the target gm2
configure:20675: result: host tool
configure:20684: checking where to find the target ld
configure:20717: result: host tool
configure:20726: checking where to find the target lipo
configure:20748: result: host tool
configure:20757: checking where to find the target nm
configure:20790: result: host tool
configure:20799: checking where to find the target objcopy
configure:20832: result: host tool
configure:20841: checking where to find the target objdump
configure:20874: result: host tool
configure:20883: checking where to find the target otool
configure:20905: result: host tool
configure:20914: checking where to find the target ranlib
configure:20947: result: host tool
configure:20956: checking where to find the target readelf
configure:20989: result: host tool
configure:20998: checking where to find the target strip
configure:21031: result: host tool
configure:21040: checking where to find the target windres
configure:21073: result: host tool
configure:21082: checking where to find the target windmc
configure:21115: result: host tool
configure:21141: checking for clang for target
configure:21162: $$r/$(HOST_SUBDIR)/gcc/xgcc -B$$r/$(HOST_SUBDIR)/gcc/ -c -g -O2  conftest.c >&5
/home/tcwg-build/workspace/tcwg_gnu_6/abe/snapshots/gcc.git~master/configure: line 1860: $$r/$(HOST_SUBDIR)/gcc/xgcc: No such file or directory
configure:21162: $? = 127
configure: failed program was:
| /* confdefs.h */
| #define PACKAGE_NAME ""
| #define PACKAGE_TARNAME ""
| #define PACKAGE_VERSION ""
| #define PACKAGE_STRING ""
| #define PACKAGE_BUGREPORT ""
| #define PACKAGE_URL ""
| #define HAVE_CXX14 1
| #define LT_OBJDIR ".libs/"
| /* end confdefs.h.  */
| 
| #ifndef __clang__
| #error Not clang
| #endif
| 
| int
| main ()
| {
| 
|   ;
|   return 0;
| }
configure:21169: result: no
configure:21240: checking for gcc for target
configure:21257: $$r/$(HOST_SUBDIR)/gcc/xgcc -B$$r/$(HOST_SUBDIR)/gcc/ -c -g -O2  conftest.c >&5
/home/tcwg-build/workspace/tcwg_gnu_6/abe/snapshots/gcc.git~master/configure: line 1860: $$r/$(HOST_SUBDIR)/gcc/xgcc: No such file or directory
configure:21257: $? = 127
configure: failed program was:
| /* confdefs.h */
| #define PACKAGE_NAME ""
| #define PACKAGE_TARNAME ""
| #define PACKAGE_VERSION ""
| #define PACKAGE_STRING ""
| #define PACKAGE_BUGREPORT ""
| #define PACKAGE_URL ""
| #define HAVE_CXX14 1
| #define LT_OBJDIR ".libs/"
| /* end confdefs.h.  */
| 
| int
| main ()
| {
| 
|   ;
|   return 0;
| }
configure:21264: result: no
configure:21267: checking for target -plugin option
configure:21284: result: no
configure:21325: checking whether to enable maintainer-specific portions of Makefiles
configure:21334: result: no
configure:21572: creating ./config.status

## ---------------------- ##
## Running config.status. ##
## ---------------------- ##

This file was extended by config.status, which was
generated by GNU Autoconf 2.69.  Invocation command line was

  CONFIG_FILES    = 
  CONFIG_HEADERS  = 
  CONFIG_LINKS    = 
  CONFIG_COMMANDS = 
  $ ./config.status 

on 41cf44d68fc0

config.status:1127: creating Makefile

## ---------------- ##
## Cache variables. ##
## ---------------- ##

ac_cv_build=aarch64-unknown-linux-gnu
ac_cv_c_compiler_gnu=yes
ac_cv_cxx_compiler_gnu=yes
ac_cv_env_A68_FOR_TARGET_set=
ac_cv_env_A68_FOR_TARGET_value=
ac_cv_env_AR_FOR_TARGET_set=
ac_cv_env_AR_FOR_TARGET_value=
ac_cv_env_AR_set=
ac_cv_env_AR_value=
ac_cv_env_AS_FOR_TARGET_set=
ac_cv_env_AS_FOR_TARGET_value=
ac_cv_env_AS_set=
ac_cv_env_AS_value=
ac_cv_env_CCC_set=
ac_cv_env_CCC_value=
ac_cv_env_CC_FOR_TARGET_set=
ac_cv_env_CC_FOR_TARGET_value=
ac_cv_env_CC_set=
ac_cv_env_CC_value=
ac_cv_env_CFLAGS_set=
ac_cv_env_CFLAGS_value=
ac_cv_env_CPPFLAGS_set=
ac_cv_env_CPPFLAGS_value=
ac_cv_env_CPP_set=
ac_cv_env_CPP_value=
ac_cv_env_CXXFLAGS_set=
ac_cv_env_CXXFLAGS_value=
ac_cv_env_CXX_FOR_TARGET_set=
ac_cv_env_CXX_FOR_TARGET_value=
ac_cv_env_CXX_set=
ac_cv_env_CXX_value=
ac_cv_env_DLLTOOL_FOR_TARGET_set=
ac_cv_env_DLLTOOL_FOR_TARGET_value=
ac_cv_env_DLLTOOL_set=
ac_cv_env_DLLTOOL_value=
ac_cv_env_DSYMUTIL_FOR_TARGET_set=
ac_cv_env_DSYMUTIL_FOR_TARGET_value=
ac_cv_env_DSYMUTIL_set=
ac_cv_env_DSYMUTIL_value=
ac_cv_env_GCC_FOR_TARGET_set=
ac_cv_env_GCC_FOR_TARGET_value=
ac_cv_env_GDC_FOR_TARGET_set=
ac_cv_env_GDC_FOR_TARGET_value=
ac_cv_env_GFORTRAN_FOR_TARGET_set=
ac_cv_env_GFORTRAN_FOR_TARGET_value=
ac_cv_env_GM2_FOR_TARGET_set=
ac_cv_env_GM2_FOR_TARGET_value=
ac_cv_env_GOC_FOR_TARGET_set=
ac_cv_env_GOC_FOR_TARGET_value=
ac_cv_env_LDFLAGS_set=
ac_cv_env_LDFLAGS_value=
ac_cv_env_LD_FOR_TARGET_set=
ac_cv_env_LD_FOR_TARGET_value=
ac_cv_env_LD_set=
ac_cv_env_LD_value=
ac_cv_env_LIBS_set=
ac_cv_env_LIBS_value=
ac_cv_env_LIPO_FOR_TARGET_set=
ac_cv_env_LIPO_FOR_TARGET_value=
ac_cv_env_LIPO_set=
ac_cv_env_LIPO_value=
ac_cv_env_NM_FOR_TARGET_set=
ac_cv_env_NM_FOR_TARGET_value=
ac_cv_env_NM_set=
ac_cv_env_NM_value=
ac_cv_env_OBJCOPY_FOR_TARGET_set=
ac_cv_env_OBJCOPY_FOR_TARGET_value=
ac_cv_env_OBJCOPY_set=
ac_cv_env_OBJCOPY_value=
ac_cv_env_OBJDUMP_FOR_TARGET_set=
ac_cv_env_OBJDUMP_FOR_TARGET_value=
ac_cv_env_OBJDUMP_set=
ac_cv_env_OBJDUMP_value=
ac_cv_env_OTOOL_FOR_TARGET_set=
ac_cv_env_OTOOL_FOR_TARGET_value=
ac_cv_env_OTOOL_set=
ac_cv_env_OTOOL_value=
ac_cv_env_RANLIB_FOR_TARGET_set=
ac_cv_env_RANLIB_FOR_TARGET_value=
ac_cv_env_RANLIB_set=
ac_cv_env_RANLIB_value=
ac_cv_env_READELF_FOR_TARGET_set=
ac_cv_env_READELF_FOR_TARGET_value=
ac_cv_env_READELF_set=
ac_cv_env_READELF_value=
ac_cv_env_STRIP_FOR_TARGET_set=
ac_cv_env_STRIP_FOR_TARGET_value=
ac_cv_env_STRIP_set=
ac_cv_env_STRIP_value=
ac_cv_env_WINDMC_FOR_TARGET_set=
ac_cv_env_WINDMC_FOR_TARGET_value=
ac_cv_env_WINDMC_set=
ac_cv_env_WINDMC_value=
ac_cv_env_WINDRES_FOR_TARGET_set=
ac_cv_env_WINDRES_FOR_TARGET_value=
ac_cv_env_WINDRES_set=
ac_cv_env_WINDRES_value=
ac_cv_env_build_alias_set=
ac_cv_env_build_alias_value=
ac_cv_env_build_configargs_set=
ac_cv_env_build_configargs_value=
ac_cv_env_host_alias_set=
ac_cv_env_host_alias_value=
ac_cv_env_host_configargs_set=
ac_cv_env_host_configargs_value=
ac_cv_env_target_alias_set=
ac_cv_env_target_alias_value=
ac_cv_env_target_configargs_set=
ac_cv_env_target_configargs_value=
ac_cv_host=aarch64-unknown-linux-gnu
ac_cv_objext=o
ac_cv_path_EGREP='/usr/bin/grep -E'
ac_cv_path_GREP=/usr/bin/grep
ac_cv_path_SED=/usr/bin/sed
ac_cv_path_install='/usr/bin/install -c'
ac_cv_prog_AR=ar
ac_cv_prog_AR_FOR_TARGET=ar
ac_cv_prog_AS=as
ac_cv_prog_AS_FOR_TARGET=as
ac_cv_prog_AWK=gawk
ac_cv_prog_BISON=bison
ac_cv_prog_CC_FOR_TARGET=cc
ac_cv_prog_CPP='gcc -E'
ac_cv_prog_CXX_FOR_TARGET=c++
ac_cv_prog_DSYMUTIL=dsymutil
ac_cv_prog_DSYMUTIL_FOR_TARGET=dsymutil
ac_cv_prog_EXPECT=expect
ac_cv_prog_FLEX=flex
ac_cv_prog_GCC_FOR_TARGET=gcc
ac_cv_prog_GDC_FOR_TARGET=gdc
ac_cv_prog_GFORTRAN_FOR_TARGET=gfortran
ac_cv_prog_GM2_FOR_TARGET=gm2
ac_cv_prog_LD=ld
ac_cv_prog_LD_FOR_TARGET=ld
ac_cv_prog_LEX=flex
ac_cv_prog_M4=m4
ac_cv_prog_MAKEINFO=makeinfo
ac_cv_prog_NM=nm
ac_cv_prog_NM_FOR_TARGET=nm
ac_cv_prog_OBJCOPY=objcopy
ac_cv_prog_OBJCOPY_FOR_TARGET=objcopy
ac_cv_prog_OBJDUMP=objdump
ac_cv_prog_OBJDUMP_FOR_TARGET=objdump
ac_cv_prog_RANLIB=ranlib
ac_cv_prog_RANLIB_FOR_TARGET=ranlib
ac_cv_prog_READELF=readelf
ac_cv_prog_READELF_FOR_TARGET=readelf
ac_cv_prog_RUNTEST=runtest
ac_cv_prog_STRIP=strip
ac_cv_prog_STRIP_FOR_TARGET=strip
ac_cv_prog_YACC='bison -y'
ac_cv_prog_ac_ct_CC=gcc
ac_cv_prog_ac_ct_CXX=g++
ac_cv_prog_ac_ct_GDC=gdc
ac_cv_prog_ac_ct_GNATBIND=gnatbind
ac_cv_prog_ac_ct_GNATMAKE=gnatmake
ac_cv_prog_ac_ct_LLVM_CONFIG=llvm-config
ac_cv_prog_cc_c89=
ac_cv_prog_cc_c99=
ac_cv_prog_cc_g=yes
ac_cv_prog_cxx_g=yes
ac_cv_search_dlopen='none required'
ac_cv_search_pthread_create='none required'
ac_cv_target=aarch64-unknown-linux-gnu
acx_cv_cc_gcc_supports_ada=yes
acx_cv_d_compiler_works=yes
acx_cv_prog_LN=ln
ax_cv_cxx_compile_cxx14=yes
clang_cv_is_clang=no
clang_target_cv_working=no
gcc_cv_prog_cmp_skip='cmp --ignore-initial=16 $$f1 $$f2'
gcc_cv_tool_dirs=/home/tcwg-build/workspace/tcwg_gnu_6/abe/builds/destdir/aarch64-unknown-linux-gnu/libexec/gcc/aarch64-unknown-linux-gnu/17.0.0:/home/tcwg-build/workspace/tcwg_gnu_6/abe/builds/destdir/aarch64-unknown-linux-gnu/libexec/gcc/aarch64-unknown-linux-gnu:/usr/lib/gcc/aarch64-unknown-linux-gnu/17.0.0:/usr/lib/gcc/aarch64-unknown-linux-gnu:/home/tcwg-build/workspace/tcwg_gnu_6/abe/builds/destdir/aarch64-unknown-linux-gnu/aarch64-unknown-linux-gnu/bin/aarch64-unknown-linux-gnu/17.0.0:/home/tcwg-build/workspace/tcwg_gnu_6/abe/builds/destdir/aarch64-unknown-linux-gnu/aarch64-unknown-linux-gnu/bin:
gcc_cv_tool_prefix=/home/tcwg-build/workspace/tcwg_gnu_6/abe/builds/destdir/aarch64-unknown-linux-gnu
gcc_target_cv_working=no
lt_cv_objdir=.libs

## ----------------- ##
## Output variables. ##
## ----------------- ##

A68='no'
A68FLAGS='-g -O2'
A68_FOR_BUILD='$(A68)'
A68_FOR_TARGET='$(A68)'
AR='ar'
AR_FOR_BUILD='$(AR)'
AR_FOR_TARGET='$(AR)'
AR_PLUGIN_OPTION='--plugin /usr/libexec/gcc/aarch64-linux-gnu/13/liblto_plugin.so'
AR_PLUGIN_OPTION_FOR_TARGET=''
AS='as'
AS_FOR_BUILD='$(AS)'
AS_FOR_TARGET='$(AS)'
AWK='gawk'
BISON='bison'
BUILD_CONFIG=''
CARGO='no'
CC='gcc'
CC_FOR_BUILD='$(CC)'
CC_FOR_TARGET='$$r/$(HOST_SUBDIR)/gcc/xgcc -B$$r/$(HOST_SUBDIR)/gcc/'
CFLAGS='-g -O2'
CFLAGS_FOR_BUILD='-g -O2'
CFLAGS_FOR_TARGET='-g -O2'
COMPILER_AS_FOR_TARGET='$$r/$(HOST_SUBDIR)/gcc/as'
COMPILER_LD_FOR_TARGET='$$r/$(HOST_SUBDIR)/gcc/collect-ld'
COMPILER_NM_FOR_TARGET='$$r/$(HOST_SUBDIR)/gcc/nm'
CONFIGURE_GDB_TK=''
CPP='gcc -E'
CPPFLAGS=''
CPPFLAGS_FOR_BUILD=''
CPP_FOR_BUILD='$(CC_FOR_BUILD) -E'
CRAB1_LIBS=''
CXX='g++'
CXXFLAGS='-g -O2'
CXXFLAGS_FOR_BUILD='-g -O2'
CXXFLAGS_FOR_TARGET='-g -O2'
CXX_FOR_BUILD='$(CXX)'
CXX_FOR_TARGET='$$r/$(HOST_SUBDIR)/gcc/xg++ -B$$r/$(HOST_SUBDIR)/gcc/ -nostdinc++ `if test -f $$r/$(TARGET_SUBDIR)/libstdc++-v3/scripts/testsuite_flags; then $(SHELL) $$r/$(TARGET_SUBDIR)/libstdc++-v3/scripts/testsuite_flags --build-includes; else echo -funconfigured-libstdc++-v3 ; fi` -L$$r/$(TARGET_SUBDIR)/libstdc++-v3/src -L$$r/$(TARGET_SUBDIR)/libstdc++-v3/src/.libs -L$$r/$(TARGET_SUBDIR)/libstdc++-v3/libsupc++/.libs'
DEBUG_PREFIX_CFLAGS_FOR_TARGET=''
DEFS='-DPACKAGE_NAME=\"\" -DPACKAGE_TARNAME=\"\" -DPACKAGE_VERSION=\"\" -DPACKAGE_STRING=\"\" -DPACKAGE_BUGREPORT=\"\" -DPACKAGE_URL=\"\" -DHAVE_CXX14=1 -DLT_OBJDIR=\".libs/\"'
DLLTOOL='dlltool'
DLLTOOL_FOR_BUILD='$(DLLTOOL)'
DLLTOOL_FOR_TARGET='$(DLLTOOL)'
DSYMUTIL='dsymutil'
DSYMUTIL_FOR_BUILD='$(DSYMUTIL)'
DSYMUTIL_FOR_TARGET='$(DSYMUTIL)'
ECHO_C=''
ECHO_N='-n'
ECHO_T=''
EGREP='/usr/bin/grep -E'
EXEEXT=''
EXPECT='expect'
FLAGS_FOR_TARGET=' -B$(build_tooldir)/bin/ -B$(build_tooldir)/lib/ -isystem $(build_tooldir)/include -isystem $(build_tooldir)/sys-include'
FLEX='flex'
GCC_FOR_TARGET='$$r/$(HOST_SUBDIR)/gcc/xgcc -B$$r/$(HOST_SUBDIR)/gcc/'
GCC_SHLIB_SUBDIR=''
GDB_TK=''
GDC='gdc'
GDCFLAGS='-g -O2'
GDC_FOR_BUILD='$(GDC)'
GDC_FOR_TARGET='$(GDC)'
GFORTRAN_FOR_BUILD='$(GFORTRAN)'
GFORTRAN_FOR_TARGET='$$r/$(HOST_SUBDIR)/gcc/gfortran -B$$r/$(HOST_SUBDIR)/gcc/'
GM2_FOR_TARGET='$(GM2)'
GNATBIND='gnatbind'
GNATMAKE='gnatmake'
GNATMAKE_FOR_BUILD='$(GNATMAKE)'
GOC_FOR_BUILD='$(GOC)'
GOC_FOR_TARGET='$(GOC)'
GREP='/usr/bin/grep'
HAVE_CXX14='1'
HAVE_CXX14_FOR_BUILD=''
INSTALL_DATA='${INSTALL} -m 644'
INSTALL_GDB_TK=''
INSTALL_PROGRAM='${INSTALL}'
INSTALL_SCRIPT='${INSTALL}'
LD='ld'
LDFLAGS=''
LDFLAGS_FOR_BUILD=''
LDFLAGS_FOR_TARGET=''
LD_FOR_BUILD='$(LD)'
LD_FOR_TARGET='$(LD)'
LEX='flex'
LIBOBJS=''
LIBS=''
LIPO='lipo'
LIPO_FOR_TARGET='$(LIPO)'
LLVM_CONFIG='llvm-config'
LLVM_CONFIG_FOR_TARGET=''
LN='ln'
LN_S='ln -s'
LTLIBOBJS=''
M4='m4'
MAINT='#'
MAINTAINER_MODE_FALSE=''
MAINTAINER_MODE_TRUE='#'
MAKEINFO='/home/tcwg-build/workspace/tcwg_gnu_6/abe/snapshots/gcc.git~master/missing makeinfo'
NM='nm'
NM_FOR_BUILD='$(NM)'
NM_FOR_TARGET='$(NM)'
NM_PLUGIN_OPTION='--plugin /usr/libexec/gcc/aarch64-linux-gnu/13/liblto_plugin.so'
NM_PLUGIN_OPTION_FOR_TARGET=''
OBJCOPY='objcopy'
OBJCOPY_FOR_TARGET='$(OBJCOPY)'
OBJDUMP='objdump'
OBJDUMP_FOR_TARGET='$(OBJDUMP)'
OBJEXT='o'
OTOOL='otool'
OTOOL_FOR_TARGET='$(OTOOL)'
PACKAGE_BUGREPORT=''
PACKAGE_NAME=''
PACKAGE_STRING=''
PACKAGE_TARNAME=''
PACKAGE_URL=''
PACKAGE_VERSION=''
PATH_SEPARATOR=':'
PGO_BUILD_GEN_CFLAGS=''
PGO_BUILD_LTO_CFLAGS=''
PGO_BUILD_USE_CFLAGS=''
PICFLAG=''
PKG_CONFIG_PATH=''
RANLIB='ranlib'
RANLIB_FOR_BUILD='$(RANLIB)'
RANLIB_FOR_TARGET='$(RANLIB)'
RANLIB_PLUGIN_OPTION='--plugin /usr/libexec/gcc/aarch64-linux-gnu/13/liblto_plugin.so'
RANLIB_PLUGIN_OPTION_FOR_TARGET=''
RAW_CXX_FOR_TARGET='$$r/$(HOST_SUBDIR)/gcc/xgcc -shared-libgcc -B$$r/$(HOST_SUBDIR)/gcc -nostdinc++ -L$$r/$(TARGET_SUBDIR)/libstdc++-v3/src -L$$r/$(TARGET_SUBDIR)/libstdc++-v3/src/.libs -L$$r/$(TARGET_SUBDIR)/libstdc++-v3/libsupc++/.libs'
READELF='readelf'
READELF_FOR_TARGET='$(READELF)'
RPATH_ENVVAR='LD_LIBRARY_PATH'
RUNTEST='runtest'
SED='/usr/bin/sed'
SHELL='/bin/bash'
STRIP='strip'
STRIP_FOR_TARGET='$(STRIP)'
SYSROOT_CFLAGS_FOR_TARGET=''
TOPLEVEL_CONFIGURE_ARGUMENTS=''\''/home/tcwg-build/workspace/tcwg_gnu_6/abe/snapshots/gcc.git~master/configure'\'' SHELL=/bin/bash --with-mpc=/home/tcwg-build/workspace/tcwg_gnu_6/abe/builds/destdir/aarch64-unknown-linux-gnu --with-mpfr=/home/tcwg-build/workspace/tcwg_gnu_6/abe/builds/destdir/aarch64-unknown-linux-gnu --with-gmp=/home/tcwg-build/workspace/tcwg_gnu_6/abe/builds/destdir/aarch64-unknown-linux-gnu --with-gnu-as --with-gnu-ld --disable-libmudflap --enable-lto --enable-shared --without-included-gettext --enable-nls --with-system-zlib --disable-sjlj-exceptions --enable-gnu-unique-object --enable-linker-build-id --disable-libstdcxx-pch --enable-c99 --enable-clocale=gnu --enable-libstdcxx-debug --enable-long-long --with-cloog=no --with-ppl=no --with-isl=no --disable-multilib --enable-fix-cortex-a53-835769 --enable-fix-cortex-a53-843419 --with-arch=armv8-a --enable-threads=posix --enable-multiarch --enable-libstdcxx-time=yes --enable-gnu-indirect-function --enable-checking=yes --disable-bootstrap --enable-languages=default --prefix=/home/tcwg-build/workspace/tcwg_gnu_6/abe/builds/destdir/aarch64-unknown-linux-gnu'
WINDMC='windmc'
WINDMC_FOR_BUILD='$(WINDMC)'
WINDMC_FOR_TARGET='$(WINDMC)'
WINDRES='windres'
WINDRES_FOR_BUILD='$(WINDRES)'
WINDRES_FOR_TARGET='$(WINDRES)'
YACC='bison -y'
ac_ct_CC='gcc'
ac_ct_CXX='g++'
bindir='${exec_prefix}/bin'
build='aarch64-unknown-linux-gnu'
build_alias=''
build_configargs=' --cache-file=./config.cache '\''--with-mpc=/home/tcwg-build/workspace/tcwg_gnu_6/abe/builds/destdir/aarch64-unknown-linux-gnu'\'' '\''--with-mpfr=/home/tcwg-build/workspace/tcwg_gnu_6/abe/builds/destdir/aarch64-unknown-linux-gnu'\'' '\''--with-gmp=/home/tcwg-build/workspace/tcwg_gnu_6/abe/builds/destdir/aarch64-unknown-linux-gnu'\'' '\''--with-gnu-as'\'' '\''--with-gnu-ld'\'' '\''--disable-libmudflap'\'' '\''--enable-lto'\'' '\''--enable-shared'\'' '\''--without-included-gettext'\'' '\''--enable-nls'\'' '\''--with-system-zlib'\'' '\''--disable-sjlj-exceptions'\'' '\''--enable-gnu-unique-object'\'' '\''--enable-linker-build-id'\'' '\''--disable-libstdcxx-pch'\'' '\''--enable-c99'\'' '\''--enable-clocale=gnu'\'' '\''--enable-libstdcxx-debug'\'' '\''--enable-long-long'\'' '\''--with-cloog=no'\'' '\''--with-ppl=no'\'' '\''--with-isl=no'\'' '\''--disable-multilib'\'' '\''--enable-fix-cortex-a53-835769'\'' '\''--enable-fix-cortex-a53-843419'\'' '\''--with-arch=armv8-a'\'' '\''--enable-threads=posix'\'' '\''--enable-multiarch'\'' '\''--enable-libstdcxx-time=yes'\'' '\''--enable-gnu-indirect-function'\'' '\''--enable-checking=yes'\'' '\''--disable-bootstrap'\'' '\''--prefix=/home/tcwg-build/workspace/tcwg_gnu_6/abe/builds/destdir/aarch64-unknown-linux-gnu'\'' '\''--enable-languages=c,c++,fortran,lto,objc'\'' --program-transform-name='\''s,y,y,'\'' --disable-option-checking --disable-year2038'
build_configdirs=' libiberty libcpp fixincludes'
build_cpu='aarch64'
build_libsubdir='build-aarch64-unknown-linux-gnu'
build_noncanonical='aarch64-unknown-linux-gnu'
build_os='linux-gnu'
build_subdir='build-aarch64-unknown-linux-gnu'
build_tooldir='${exec_prefix}/aarch64-unknown-linux-gnu'
build_vendor='unknown'
compare_exclusions='gcc/cc*-checksum$(objext) | gcc/ada/*tools/* | gcc/m2/gm2-compiler-boot/M2Version* | gcc/m2/gm2-compiler-boot/SYSTEM* | gcc/m2/gm2version* | gcc/cobol/parse$(objext)'
configdirs=' libiberty libbacktrace libcpp libcody libdecnumber fixincludes gcc libcc1 c++tools lto-plugin'
cpu_type='aarch64'
datadir='${datarootdir}'
datarootdir='${prefix}/share'
do_compare='cmp --ignore-initial=16 $$f1 $$f2'
docdir='${datarootdir}/doc/${PACKAGE}'
dvidir='${docdir}'
enable_libgdiagnostics='no'
exec_prefix='${prefix}'
extra_host_libiberty_configure_flags='--enable-shared'
extra_host_zlib_configure_flags=''
extra_isl_gmp_configure_flags=''
extra_linker_plugin_configure_flags=''
extra_linker_plugin_flags=''
extra_mpc_gmp_configure_flags=''
extra_mpc_mpfr_configure_flags=''
extra_mpfr_configure_flags=''
gcc_host_pie=''
get_gcc_base_ver='cat'
gmpinc='-I/home/tcwg-build/workspace/tcwg_gnu_6/abe/builds/destdir/aarch64-unknown-linux-gnu/include -I/home/tcwg-build/workspace/tcwg_gnu_6/abe/builds/destdir/aarch64-unknown-linux-gnu/include -I/home/tcwg-build/workspace/tcwg_gnu_6/abe/builds/destdir/aarch64-unknown-linux-gnu/include '
gmplibs='-L/home/tcwg-build/workspace/tcwg_gnu_6/abe/builds/destdir/aarch64-unknown-linux-gnu/lib -L/home/tcwg-build/workspace/tcwg_gnu_6/abe/builds/destdir/aarch64-unknown-linux-gnu/lib -L/home/tcwg-build/workspace/tcwg_gnu_6/abe/builds/destdir/aarch64-unknown-linux-gnu/lib -lmpc -lmpfr -lgmp'
host='aarch64-unknown-linux-gnu'
host_alias=''
host_configargs=' --cache-file=./config.cache  --with-system-zlib '\''--with-mpc=/home/tcwg-build/workspace/tcwg_gnu_6/abe/builds/destdir/aarch64-unknown-linux-gnu'\'' '\''--with-mpfr=/home/tcwg-build/workspace/tcwg_gnu_6/abe/builds/destdir/aarch64-unknown-linux-gnu'\'' '\''--with-gmp=/home/tcwg-build/workspace/tcwg_gnu_6/abe/builds/destdir/aarch64-unknown-linux-gnu'\'' '\''--with-gnu-as'\'' '\''--with-gnu-ld'\'' '\''--disable-libmudflap'\'' '\''--enable-lto'\'' '\''--enable-shared'\'' '\''--without-included-gettext'\'' '\''--enable-nls'\'' '\''--with-system-zlib'\'' '\''--disable-sjlj-exceptions'\'' '\''--enable-gnu-unique-object'\'' '\''--enable-linker-build-id'\'' '\''--disable-libstdcxx-pch'\'' '\''--enable-c99'\'' '\''--enable-clocale=gnu'\'' '\''--enable-libstdcxx-debug'\'' '\''--enable-long-long'\'' '\''--with-cloog=no'\'' '\''--with-ppl=no'\'' '\''--with-isl=no'\'' '\''--disable-multilib'\'' '\''--enable-fix-cortex-a53-835769'\'' '\''--enable-fix-cortex-a53-843419'\'' '\''--with-arch=armv8-a'\'' '\''--enable-threads=posix'\'' '\''--enable-multiarch'\'' '\''--enable-libstdcxx-time=yes'\'' '\''--enable-gnu-indirect-function'\'' '\''--enable-checking=yes'\'' '\''--disable-bootstrap'\'' '\''--prefix=/home/tcwg-build/workspace/tcwg_gnu_6/abe/builds/destdir/aarch64-unknown-linux-gnu'\'' '\''--enable-languages=c,c++,fortran,lto,objc'\'' --program-transform-name='\''s,y,y,'\'' --disable-option-checking --disable-year2038'
host_cpu='aarch64'
host_libs_picflag=''
host_noncanonical='aarch64-unknown-linux-gnu'
host_os='linux-gnu'
host_pie='no'
host_shared='no'
host_subdir='.'
host_vendor='unknown'
htmldir='${docdir}'
includedir='${prefix}/include'
infodir='${datarootdir}/info'
islinc=''
isllibs=''
libdir='${exec_prefix}/lib'
libexecdir='${exec_prefix}/libexec'
localedir='${datarootdir}/locale'
localstatedir='${prefix}/var'
mandir='${datarootdir}/man'
oldincludedir='/usr/include'
pdfdir='${docdir}'
poststage1_ldflags='-static-libstdc++ -static-libgcc'
poststage1_libs=''
prefix='/home/tcwg-build/workspace/tcwg_gnu_6/abe/builds/destdir/aarch64-unknown-linux-gnu'
program_transform_name='s,y,y,'
psdir='${docdir}'
sbindir='${exec_prefix}/sbin'
sharedstatedir='${prefix}/com'
stage1_cflags='-g'
stage1_checking='--enable-checking=yes,types'
stage1_languages='c,c++,lto'
stage1_ldflags='-static-libstdc++ -static-libgcc'
stage1_libs=''
stage2_werror_flag='--enable-werror-always'
sysconfdir='${prefix}/etc'
target='aarch64-unknown-linux-gnu'
target_alias=''
target_configargs='--cache-file=./config.cache   '\''--with-mpc=/home/tcwg-build/workspace/tcwg_gnu_6/abe/builds/destdir/aarch64-unknown-linux-gnu'\'' '\''--with-mpfr=/home/tcwg-build/workspace/tcwg_gnu_6/abe/builds/destdir/aarch64-unknown-linux-gnu'\'' '\''--with-gmp=/home/tcwg-build/workspace/tcwg_gnu_6/abe/builds/destdir/aarch64-unknown-linux-gnu'\'' '\''--with-gnu-as'\'' '\''--with-gnu-ld'\'' '\''--disable-libmudflap'\'' '\''--enable-lto'\'' '\''--enable-shared'\'' '\''--without-included-gettext'\'' '\''--enable-nls'\'' '\''--with-system-zlib'\'' '\''--disable-sjlj-exceptions'\'' '\''--enable-gnu-unique-object'\'' '\''--enable-linker-build-id'\'' '\''--disable-libstdcxx-pch'\'' '\''--enable-c99'\'' '\''--enable-clocale=gnu'\'' '\''--enable-libstdcxx-debug'\'' '\''--enable-long-long'\'' '\''--with-cloog=no'\'' '\''--with-ppl=no'\'' '\''--with-isl=no'\'' '\''--disable-multilib'\'' '\''--enable-fix-cortex-a53-835769'\'' '\''--enable-fix-cortex-a53-843419'\'' '\''--with-arch=armv8-a'\'' '\''--enable-threads=posix'\'' '\''--enable-multiarch'\'' '\''--enable-libstdcxx-time=yes'\'' '\''--enable-gnu-indirect-function'\'' '\''--enable-checking=yes'\'' '\''--disable-bootstrap'\'' '\''--prefix=/home/tcwg-build/workspace/tcwg_gnu_6/abe/builds/destdir/aarch64-unknown-linux-gnu'\'' '\''--enable-languages=c,c++,fortran,lto,objc'\'' --program-transform-name='\''s,y,y,'\'' --disable-option-checking --disable-year2038'
target_configdirs=' libgcc libbacktrace libgomp libatomic libitm libstdc++-v3 libsanitizer libvtv libssp libquadmath libgfortran libobjc'
target_cpu='aarch64'
target_noncanonical='aarch64-unknown-linux-gnu'
target_os='linux-gnu'
target_subdir='aarch64-unknown-linux-gnu'
target_vendor='unknown'
tooldir='${exec_prefix}/aarch64-unknown-linux-gnu'

## ------------------- ##
## File substitutions. ##
## ------------------- ##

alphaieee_frag='/dev/null'
host_makefile_frag='/dev/null'
ospace_frag='/dev/null'
serialization_dependencies='serdep.tmp'
target_makefile_frag='/home/tcwg-build/workspace/tcwg_gnu_6/abe/snapshots/gcc.git~master/config/mt-gnu'

## ----------- ##
## confdefs.h. ##
## ----------- ##

/* confdefs.h */
#define PACKAGE_NAME ""
#define PACKAGE_TARNAME ""
#define PACKAGE_VERSION ""
#define PACKAGE_STRING ""
#define PACKAGE_BUGREPORT ""
#define PACKAGE_URL ""
#define HAVE_CXX14 1
#define LT_OBJDIR ".libs/"

configure: exit 0

## ---------------------- ##
## Running config.status. ##
## ---------------------- ##

This file was extended by config.status, which was
generated by GNU Autoconf 2.69.  Invocation command line was

  CONFIG_FILES    = 
  CONFIG_HEADERS  = 
  CONFIG_LINKS    = 
  CONFIG_COMMANDS = 
  $ ./config.status --file=-

on 41cf44d68fc0

